BDBM50177151 CHEMBL3814147
SMILES N[C@@H](COP(O)(=O)O[C@H]1C=CCO[C@@H]1COC(=O)CCc1ccccc1OCc1cccc(Oc2ccccc2)c1)C(O)=O
InChI Key InChIKey=IANLQJOTLNXMJQ-PIZZNKLWSA-N
Data  4 EC50
  Tab Delimited (TSV)   2D SDfile   Computed 3D by Vconf -m prep SDfile
Find this compound or compounds like it in BindingDB:
Activity Spreadsheet -- Enzyme Inhibition Constant Data from BindingDB
Found 2 hits for monomerid = 50177151
TargetProbable G-protein coupled receptor 34(Mus musculus)
The University Of Tokyo
Curated by ChEMBL
LigandPNGBDBM50177151(CHEMBL3814147)
Affinity DataEC50:  460nM. Assay description: Agonist activity at mouse GPR34 expressed in HEK293A cells cotransfected with chimeric Galphaq/il after 1.5 hrs by alkaline phosphatase tagged-TGFalp...
In DepthDetails ArticlePubMed
TargetProbable G-protein coupled receptor 34(Mus musculus)
The University Of Tokyo
Curated by ChEMBL
LigandPNGBDBM50177151(CHEMBL3814147)
Affinity DataEC50:  468nM. Assay description: Agonist activity at mouse GPR34 expressed in HEK293A cells cotransfected with chimeric Galphaq/il after 1.5 hrs by alkaline phosphatase tagged-TGFalp...
In DepthDetails ArticlePubMed